{"text_format":"1","workbook":"xlsx","n_sheets":6,"sheets":["MujSeznam","SerazenySeznam","Check","Generator","SeznamCetby","Poznamky"],"not_rendered":{"charts":0,"images":1,"macros":1,"external_links":0,"defined_names":0,"comments":0,"pivot_tables":0},"unopened":[],"bounds":{"document_bytes":16777216,"sheet_cells":100000,"rows_first":2000,"rows_last":500,"rows_between":2000,"halvings":0,"cell_chars":16384,"cell_head_chars":4096},"cells_cut":0,"cells_raw":0,"read":"whole","date_system":"1900"}

{"sheet":"MujSeznam","index":0,"n_rows":21,"n_cols":6,"rows_kept":21,"cut":false,"hidden":false,"merged":[]}
["Autor","Dílo","Století","Druh","Česká/Světová","Autor-Dilo"]
[{"$f":"IFERROR(VLOOKUP(MAX(EXACT(B2,Table2[Název díla])*(ROW(Table2[Název díla]))),CHOOSE({1,2},ROW(Table2[Název díla]),Table2[Autor]),2,0), \"\")","v":""},null,{"$f":"IFERROR(VLOOKUP(MAX(EXACT(B2,Table2[Název díla])*(ROW(Table2[Název díla]))),CHOOSE({1,2},ROW(Table2[Název díla]),Table2[Století]),2,0), \"\")","v":""},{"$f":"IFERROR(VLOOKUP(MAX(EXACT(B2,Table2[Název díla])*(ROW(Table2[Název díla]))),CHOOSE({1,2},ROW(Table2[Název díla]),Table2[Druh]),2,0), \"\")","v":""},{"$f":"IFERROR(VLOOKUP(MAX(EXACT(B2,Table2[Název díla])*(ROW(Table2[Název díla]))),CHOOSE({1,2},ROW(Table2[Název díla]),Table2[Původ]),2,0), \"\")","v":""},{"$f":"Table1[[#This Row],[Autor]]&\"-\"&Table1[[#This Row],[Dílo]]","v":"-"}]
[{"$f":"IFERROR(VLOOKUP(MAX(EXACT(B3,Table2[Název díla])*(ROW(Table2[Název díla]))),CHOOSE({1,2},ROW(Table2[Název díla]),Table2[Autor]),2,0), \"\")","v":""},null,{"$f":"IFERROR(VLOOKUP(MAX(EXACT(B3,Table2[Název díla])*(ROW(Table2[Název díla]))),CHOOSE({1,2},ROW(Table2[Název díla]),Table2[Století]),2,0), \"\")","v":""},{"$f":"IFERROR(VLOOKUP(MAX(EXACT(B3,Table2[Název díla])*(ROW(Table2[Název díla]))),CHOOSE({1,2},ROW(Table2[Název díla]),Table2[Druh]),2,0), \"\")","v":""},{"$f":"IFERROR(VLOOKUP(MAX(EXACT(B3,Table2[Název díla])*(ROW(Table2[Název díla]))),CHOOSE({1,2},ROW(Table2[Název díla]),Table2[Původ]),2,0), \"\")","v":""},{"$f":"Table1[[#This Row],[Autor]]&\"-\"&Table1[[#This Row],[Dílo]]","v":"-"}]
[{"$f":"IFERROR(VLOOKUP(MAX(EXACT(B4,Table2[Název díla])*(ROW(Table2[Název díla]))),CHOOSE({1,2},ROW(Table2[Název díla]),Table2[Autor]),2,0), \"\")","v":""},null,{"$f":"IFERROR(VLOOKUP(MAX(EXACT(B4,Table2[Název díla])*(ROW(Table2[Název díla]))),CHOOSE({1,2},ROW(Table2[Název díla]),Table2[Století]),2,0), \"\")","v":""},{"$f":"IFERROR(VLOOKUP(MAX(EXACT(B4,Table2[Název díla])*(ROW(Table2[Název díla]))),CHOOSE({1,2},ROW(Table2[Název díla]),Table2[Druh]),2,0), \"\")","v":""},{"$f":"IFERROR(VLOOKUP(MAX(EXACT(B4,Table2[Název díla])*(ROW(Table2[Název díla]))),CHOOSE({1,2},ROW(Table2[Název díla]),Table2[Původ]),2,0), \"\")","v":""},{"$f":"Table1[[#This Row],[Autor]]&\"-\"&Table1[[#This Row],[Dílo]]","v":"-"}]
[{"$f":"IFERROR(VLOOKUP(MAX(EXACT(B5,Table2[Název díla])*(ROW(Table2[Název díla]))),CHOOSE({1,2},ROW(Table2[Název díla]),Table2[Autor]),2,0), \"\")","v":""},null,{"$f":"IFERROR(VLOOKUP(MAX(EXACT(B5,Table2[Název díla])*(ROW(Table2[Název díla]))),CHOOSE({1,2},ROW(Table2[Název díla]),Table2[Století]),2,0), \"\")","v":""},{"$f":"IFERROR(VLOOKUP(MAX(EXACT(B5,Table2[Název díla])*(ROW(Table2[Název díla]))),CHOOSE({1,2},ROW(Table2[Název díla]),Table2[Druh]),2,0), \"\")","v":""},{"$f":"IFERROR(VLOOKUP(MAX(EXACT(B5,Table2[Název díla])*(ROW(Table2[Název díla]))),CHOOSE({1,2},ROW(Table2[Název díla]),Table2[Původ]),2,0), \"\")","v":""},{"$f":"Table1[[#This Row],[Autor]]&\"-\"&Table1[[#This Row],[Dílo]]","v":"-"}]
[{"$f":"IFERROR(VLOOKUP(MAX(EXACT(B6,Table2[Název díla])*(ROW(Table2[Název díla]))),CHOOSE({1,2},ROW(Table2[Název díla]),Table2[Autor]),2,0), \"\")","v":""},null,{"$f":"IFERROR(VLOOKUP(MAX(EXACT(B6,Table2[Název díla])*(ROW(Table2[Název díla]))),CHOOSE({1,2},ROW(Table2[Název díla]),Table2[Století]),2,0), \"\")","v":""},{"$f":"IFERROR(VLOOKUP(MAX(EXACT(B6,Table2[Název díla])*(ROW(Table2[Název díla]))),CHOOSE({1,2},ROW(Table2[Název díla]),Table2[Druh]),2,0), \"\")","v":""},{"$f":"IFERROR(VLOOKUP(MAX(EXACT(B6,Table2[Název díla])*(ROW(Table2[Název díla]))),CHOOSE({1,2},ROW(Table2[Název díla]),Table2[Původ]),2,0), \"\")","v":""},{"$f":"Table1[[#This Row],[Autor]]&\"-\"&Table1[[#This Row],[Dílo]]","v":"-"}]
[{"$f":"IFERROR(VLOOKUP(MAX(EXACT(B7,Table2[Název díla])*(ROW(Table2[Název díla]))),CHOOSE({1,2},ROW(Table2[Název díla]),Table2[Autor]),2,0), \"\")","v":""},null,{"$f":"IFERROR(VLOOKUP(MAX(EXACT(B7,Table2[Název díla])*(ROW(Table2[Název díla]))),CHOOSE({1,2},ROW(Table2[Název díla]),Table2[Století]),2,0), \"\")","v":""},{"$f":"IFERROR(VLOOKUP(MAX(EXACT(B7,Table2[Název díla])*(ROW(Table2[Název díla]))),CHOOSE({1,2},ROW(Table2[Název díla]),Table2[Druh]),2,0), \"\")","v":""},{"$f":"IFERROR(VLOOKUP(MAX(EXACT(B7,Table2[Název díla])*(ROW(Table2[Název díla]))),CHOOSE({1,2},ROW(Table2[Název díla]),Table2[Původ]),2,0), \"\")","v":""},{"$f":"Table1[[#This Row],[Autor]]&\"-\"&Table1[[#This Row],[Dílo]]","v":"-"}]
[{"$f":"IFERROR(VLOOKUP(MAX(EXACT(B8,Table2[Název díla])*(ROW(Table2[Název díla]))),CHOOSE({1,2},ROW(Table2[Název díla]),Table2[Autor]),2,0), \"\")","v":""},null,{"$f":"IFERROR(VLOOKUP(MAX(EXACT(B8,Table2[Název díla])*(ROW(Table2[Název díla]))),CHOOSE({1,2},ROW(Table2[Název díla]),Table2[Století]),2,0), \"\")","v":""},{"$f":"IFERROR(VLOOKUP(MAX(EXACT(B8,Table2[Název díla])*(ROW(Table2[Název díla]))),CHOOSE({1,2},ROW(Table2[Název díla]),Table2[Druh]),2,0), \"\")","v":""},{"$f":"IFERROR(VLOOKUP(MAX(EXACT(B8,Table2[Název díla])*(ROW(Table2[Název díla]))),CHOOSE({1,2},ROW(Table2[Název díla]),Table2[Původ]),2,0), \"\")","v":""},{"$f":"Table1[[#This Row],[Autor]]&\"-\"&Table1[[#This Row],[Dílo]]","v":"-"}]
[{"$f":"IFERROR(VLOOKUP(MAX(EXACT(B9,Table2[Název díla])*(ROW(Table2[Název díla]))),CHOOSE({1,2},ROW(Table2[Název díla]),Table2[Autor]),2,0), \"\")","v":""},null,{"$f":"IFERROR(VLOOKUP(MAX(EXACT(B9,Table2[Název díla])*(ROW(Table2[Název díla]))),CHOOSE({1,2},ROW(Table2[Název díla]),Table2[Století]),2,0), \"\")","v":""},{"$f":"IFERROR(VLOOKUP(MAX(EXACT(B9,Table2[Název díla])*(ROW(Table2[Název díla]))),CHOOSE({1,2},ROW(Table2[Název díla]),Table2[Druh]),2,0), \"\")","v":""},{"$f":"IFERROR(VLOOKUP(MAX(EXACT(B9,Table2[Název díla])*(ROW(Table2[Název díla]))),CHOOSE({1,2},ROW(Table2[Název díla]),Table2[Původ]),2,0), \"\")","v":""},{"$f":"Table1[[#This Row],[Autor]]&\"-\"&Table1[[#This Row],[Dílo]]","v":"-"}]
[{"$f":"IFERROR(VLOOKUP(MAX(EXACT(B10,Table2[Název díla])*(ROW(Table2[Název díla]))),CHOOSE({1,2},ROW(Table2[Název díla]),Table2[Autor]),2,0), \"\")","v":""},null,{"$f":"IFERROR(VLOOKUP(MAX(EXACT(B10,Table2[Název díla])*(ROW(Table2[Název díla]))),CHOOSE({1,2},ROW(Table2[Název díla]),Table2[Století]),2,0), \"\")","v":""},{"$f":"IFERROR(VLOOKUP(MAX(EXACT(B10,Table2[Název díla])*(ROW(Table2[Název díla]))),CHOOSE({1,2},ROW(Table2[Název díla]),Table2[Druh]),2,0), \"\")","v":""},{"$f":"IFERROR(VLOOKUP(MAX(EXACT(B10,Table2[Název díla])*(ROW(Table2[Název díla]))),CHOOSE({1,2},ROW(Table2[Název díla]),Table2[Původ]),2,0), \"\")","v":""},{"$f":"Table1[[#This Row],[Autor]]&\"-\"&Table1[[#This Row],[Dílo]]","v":"-"}]
{"$rows_left_out":12}
{"sheet":"SerazenySeznam","index":1,"n_rows":21,"n_cols":5,"rows_kept":21,"cut":false,"hidden":true,"merged":[]}
["Autor","Dílo","Století","Druh","Česká/Světová"]
[{"$f":"IFERROR(VLOOKUP(B2,SeznamCetby!A$3:E$63,2,FALSE),\"\")","v":""},{"$f":"IFERROR(INDEX(Table1[Dílo],MATCH(ROWS(MujSeznam!$A$2:'MujSeznam'!A2),COUNTIF(Table1[Autor-Dilo],\"<=\"&Table1[Autor-Dilo]),0)),\"\")","v":""},{"$f":"IFERROR(VLOOKUP(B2,SeznamCetby!A$3:E$63,3,FALSE),\"\")","v":""},{"$f":"IFERROR(VLOOKUP(B2,SeznamCetby!A$3:E$63,4,FALSE),\"\")","v":""},{"$f":"IFERROR(VLOOKUP(B2,SeznamCetby!A$3:E$63,5,FALSE),\"\")","v":""}]
[{"$f":"IFERROR(VLOOKUP(B3,SeznamCetby!A$3:E$63,2,FALSE),\"\")","v":""},{"$f":"IFERROR(INDEX(Table1[Dílo],MATCH(ROWS(MujSeznam!$A$2:'MujSeznam'!A3),COUNTIF(Table1[Autor-Dilo],\"<=\"&Table1[Autor-Dilo]),0)),\"\")","v":""},{"$f":"IFERROR(VLOOKUP(B3,SeznamCetby!A$3:E$63,3,FALSE),\"\")","v":""},{"$f":"IFERROR(VLOOKUP(B3,SeznamCetby!A$3:E$63,4,FALSE),\"\")","v":""},{"$f":"IFERROR(VLOOKUP(B3,SeznamCetby!A$3:E$63,5,FALSE),\"\")","v":""}]
[{"$f":"IFERROR(VLOOKUP(B4,SeznamCetby!A$3:E$63,2,FALSE),\"\")","v":""},{"$f":"IFERROR(INDEX(Table1[Dílo],MATCH(ROWS(MujSeznam!$A$2:'MujSeznam'!A4),COUNTIF(Table1[Autor-Dilo],\"<=\"&Table1[Autor-Dilo]),0)),\"\")","v":""},{"$f":"IFERROR(VLOOKUP(B4,SeznamCetby!A$3:E$63,3,FALSE),\"\")","v":""},{"$f":"IFERROR(VLOOKUP(B4,SeznamCetby!A$3:E$63,4,FALSE),\"\")","v":""},{"$f":"IFERROR(VLOOKUP(B4,SeznamCetby!A$3:E$63,5,FALSE),\"\")","v":""}]
[{"$f":"IFERROR(VLOOKUP(B5,SeznamCetby!A$3:E$63,2,FALSE),\"\")","v":""},{"$f":"IFERROR(INDEX(Table1[Dílo],MATCH(ROWS(MujSeznam!$A$2:'MujSeznam'!A5),COUNTIF(Table1[Autor-Dilo],\"<=\"&Table1[Autor-Dilo]),0)),\"\")","v":""},{"$f":"IFERROR(VLOOKUP(B5,SeznamCetby!A$3:E$63,3,FALSE),\"\")","v":""},{"$f":"IFERROR(VLOOKUP(B5,SeznamCetby!A$3:E$63,4,FALSE),\"\")","v":""},{"$f":"IFERROR(VLOOKUP(B5,SeznamCetby!A$3:E$63,5,FALSE),\"\")","v":""}]
[{"$f":"IFERROR(VLOOKUP(B6,SeznamCetby!A$3:E$63,2,FALSE),\"\")","v":""},{"$f":"IFERROR(INDEX(Table1[Dílo],MATCH(ROWS(MujSeznam!$A$2:'MujSeznam'!A6),COUNTIF(Table1[Autor-Dilo],\"<=\"&Table1[Autor-Dilo]),0)),\"\")","v":""},{"$f":"IFERROR(VLOOKUP(B6,SeznamCetby!A$3:E$63,3,FALSE),\"\")","v":""},{"$f":"IFERROR(VLOOKUP(B6,SeznamCetby!A$3:E$63,4,FALSE),\"\")","v":""},{"$f":"IFERROR(VLOOKUP(B6,SeznamCetby!A$3:E$63,5,FALSE),\"\")","v":""}]
[{"$f":"IFERROR(VLOOKUP(B7,SeznamCetby!A$3:E$63,2,FALSE),\"\")","v":""},{"$f":"IFERROR(INDEX(Table1[Dílo],MATCH(ROWS(MujSeznam!$A$2:'MujSeznam'!A7),COUNTIF(Table1[Autor-Dilo],\"<=\"&Table1[Autor-Dilo]),0)),\"\")","v":""},{"$f":"IFERROR(VLOOKUP(B7,SeznamCetby!A$3:E$63,3,FALSE),\"\")","v":""},{"$f":"IFERROR(VLOOKUP(B7,SeznamCetby!A$3:E$63,4,FALSE),\"\")","v":""},{"$f":"IFERROR(VLOOKUP(B7,SeznamCetby!A$3:E$63,5,FALSE),\"\")","v":""}]
[{"$f":"IFERROR(VLOOKUP(B8,SeznamCetby!A$3:E$63,2,FALSE),\"\")","v":""},{"$f":"IFERROR(INDEX(Table1[Dílo],MATCH(ROWS(MujSeznam!$A$2:'MujSeznam'!A8),COUNTIF(Table1[Autor-Dilo],\"<=\"&Table1[Autor-Dilo]),0)),\"\")","v":""},{"$f":"IFERROR(VLOOKUP(B8,SeznamCetby!A$3:E$63,3,FALSE),\"\")","v":""},{"$f":"IFERROR(VLOOKUP(B8,SeznamCetby!A$3:E$63,4,FALSE),\"\")","v":""},{"$f":"IFERROR(VLOOKUP(B8,SeznamCetby!A$3:E$63,5,FALSE),\"\")","v":""}]
[{"$f":"IFERROR(VLOOKUP(B9,SeznamCetby!A$3:E$63,2,FALSE),\"\")","v":""},{"$f":"IFERROR(INDEX(Table1[Dílo],MATCH(ROWS(MujSeznam!$A$2:'MujSeznam'!A9),COUNTIF(Table1[Autor-Dilo],\"<=\"&Table1[Autor-Dilo]),0)),\"\")","v":""},{"$f":"IFERROR(VLOOKUP(B9,SeznamCetby!A$3:E$63,3,FALSE),\"\")","v":""},{"$f":"IFERROR(VLOOKUP(B9,SeznamCetby!A$3:E$63,4,FALSE),\"\")","v":""},{"$f":"IFERROR(VLOOKUP(B9,SeznamCetby!A$3:E$63,5,FALSE),\"\")","v":""}]
[{"$f":"IFERROR(VLOOKUP(B10,SeznamCetby!A$3:E$63,2,FALSE),\"\")","v":""},{"$f":"IFERROR(INDEX(Table1[Dílo],MATCH(ROWS(MujSeznam!$A$2:'MujSeznam'!A10),COUNTIF(Table1[Autor-Dilo],\"<=\"&Table1[Autor-Dilo]),0)),\"\")","v":""},{"$f":"IFERROR(VLOOKUP(B10,SeznamCetby!A$3:E$63,3,FALSE),\"\")","v":""},{"$f":"IFERROR(VLOOKUP(B10,SeznamCetby!A$3:E$63,4,FALSE),\"\")","v":""},{"$f":"IFERROR(VLOOKUP(B10,SeznamCetby!A$3:E$63,5,FALSE),\"\")","v":""}]
{"$rows_left_out":12}
{"sheet":"Check","index":2,"n_rows":22,"n_cols":9,"rows_kept":22,"cut":false,"hidden":false,"merged":[[9,6,10,8]]}
["Autoři","Poezie","Próza","Drama","Celkem",null,"Kritérium","Minimum","Splněno"]
[{"$f":"IFERROR(INDEX(Table3[Autor],MATCH(0,COUNTIF($A$1:A1,Table3[Autor]),0)),\"\")","v":""},{"$f":"COUNTIFS(Table1[Autor],Check!$A2,Table1[Druh],Check!B$1)","v":0},{"$f":"COUNTIFS(Table1[Autor],Check!$A2,Table1[Druh],Check!C$1)","v":0},{"$f":"COUNTIFS(Table1[Autor],Check!$A2,Table1[Druh],Check!D$1)","v":0},{"$f":"SUM(B2:D2)","v":0},null,"Světová a česká literatura do konce 18. stol",2,{"$f":"COUNTIF(MujSeznam!$C$2:$C$21,\"<=18\")","v":0}]
[{"$f":"IFERROR(INDEX(Table3[Autor],MATCH(0,COUNTIF($A$1:A2,Table3[Autor]),0)),\"\")","v":""},{"$f":"COUNTIFS(Table1[Autor],Check!$A3,Table1[Druh],Check!B$1)","v":0},{"$f":"COUNTIFS(Table1[Autor],Check!$A3,Table1[Druh],Check!C$1)","v":0},{"$f":"COUNTIFS(Table1[Autor],Check!$A3,Table1[Druh],Check!D$1)","v":0},{"$f":"SUM(B3:D3)","v":0},null,"Světová a česká literatura 19 stol",3,{"$f":"COUNTIF(MujSeznam!$C$2:$C$21,\"19\")","v":0}]
[{"$f":"IFERROR(INDEX(Table3[Autor],MATCH(0,COUNTIF($A$1:A3,Table3[Autor]),0)),\"\")","v":""},{"$f":"COUNTIFS(Table1[Autor],Check!$A4,Table1[Druh],Check!B$1)","v":0},{"$f":"COUNTIFS(Table1[Autor],Check!$A4,Table1[Druh],Check!C$1)","v":0},{"$f":"COUNTIFS(Table1[Autor],Check!$A4,Table1[Druh],Check!D$1)","v":0},0,null,"Světová literatura 20. a 21. stol",4,{"$f":"COUNTIFS(MujSeznam!C2:C21,\">=20\",MujSeznam!$E$2:$E$21,\"světová\")","v":0}]
[{"$f":"IFERROR(INDEX(Table3[Autor],MATCH(0,COUNTIF($A$1:A4,Table3[Autor]),0)),\"\")","v":""},{"$f":"COUNTIFS(Table1[Autor],Check!$A5,Table1[Druh],Check!B$1)","v":0},{"$f":"COUNTIFS(Table1[Autor],Check!$A5,Table1[Druh],Check!C$1)","v":0},{"$f":"COUNTIFS(Table1[Autor],Check!$A5,Table1[Druh],Check!D$1)","v":0},0,null,"Česká literatura 20. a 21. stol",5,{"$f":"COUNTIFS(MujSeznam!$C$2:$C$21,\">=20\",MujSeznam!$E$2:$E$21,\"česká\")","v":0}]
[{"$f":"IFERROR(INDEX(Table3[Autor],MATCH(0,COUNTIF($A$1:A5,Table3[Autor]),0)),\"\")","v":""},{"$f":"COUNTIFS(Table1[Autor],Check!$A6,Table1[Druh],Check!B$1)","v":0},{"$f":"COUNTIFS(Table1[Autor],Check!$A6,Table1[Druh],Check!C$1)","v":0},{"$f":"COUNTIFS(Table1[Autor],Check!$A6,Table1[Druh],Check!D$1)","v":0},0,null,"Poezie",2,{"$f":"COUNTIF(MujSeznam!$D$2:$D$21,G6)","v":0}]
[{"$f":"IFERROR(INDEX(Table3[Autor],MATCH(0,COUNTIF($A$1:A6,Table3[Autor]),0)),\"\")","v":""},{"$f":"COUNTIFS(Table1[Autor],Check!$A7,Table1[Druh],Check!B$1)","v":0},{"$f":"COUNTIFS(Table1[Autor],Check!$A7,Table1[Druh],Check!C$1)","v":0},{"$f":"COUNTIFS(Table1[Autor],Check!$A7,Table1[Druh],Check!D$1)","v":0},0,null,"Próza",2,{"$f":"COUNTIF(MujSeznam!$D$2:$D$21,G7)","v":0}]
[{"$f":"IFERROR(INDEX(Table3[Autor],MATCH(0,COUNTIF($A$1:A7,Table3[Autor]),0)),\"\")","v":""},{"$f":"COUNTIFS(Table1[Autor],Check!$A8,Table1[Druh],Check!B$1)","v":0},{"$f":"COUNTIFS(Table1[Autor],Check!$A8,Table1[Druh],Check!C$1)","v":0},{"$f":"COUNTIFS(Table1[Autor],Check!$A8,Table1[Druh],Check!D$1)","v":0},0,null,"Drama",2,{"$f":"COUNTIF(MujSeznam!$D$2:$D$21,G8)","v":0}]
[{"$f":"IFERROR(INDEX(Table3[Autor],MATCH(0,COUNTIF($A$1:A8,Table3[Autor]),0)),\"\")","v":""},{"$f":"COUNTIFS(Table1[Autor],Check!$A9,Table1[Druh],Check!B$1)","v":0},{"$f":"COUNTIFS(Table1[Autor],Check!$A9,Table1[Druh],Check!C$1)","v":0},{"$f":"COUNTIFS(Table1[Autor],Check!$A9,Table1[Druh],Check!D$1)","v":0},0,null,"Celkem",20,{"$f":"IFERROR(SUM(IF(FREQUENCY(MATCH(Table1[Dílo],Table1[Dílo],0),MATCH(Table1[Dílo],Table1[Dílo],0))>0,1)),0)","v":0}]
[{"$f":"IFERROR(INDEX(Table3[Autor],MATCH(0,COUNTIF($A$1:A9,Table3[Autor]),0)),\"\")","v":""},{"$f":"COUNTIFS(Table1[Autor],Check!$A10,Table1[Druh],Check!B$1)","v":0},{"$f":"COUNTIFS(Table1[Autor],Check!$A10,Table1[Druh],Check!C$1)","v":0},{"$f":"COUNTIFS(Table1[Autor],Check!$A10,Table1[Druh],Check!D$1)","v":0},0,null,"Pozn.: V případě, že součet děl neodpovídá, zkontrolujte, zda seznam neobsahuje jedno dílo 2x, nebo zda neobsahuje prázdná pole."]
{"$rows_left_out":13}
{"sheet":"Generator","index":3,"n_rows":53,"n_cols":3,"rows_kept":53,"cut":false,"hidden":false,"merged":[[2,0,2,2],[3,0,3,2],[4,0,4,2],[52,0,52,1]]}
[]
[]
["Jméno a příjmení: xxx"]
["Třída: xx"]
["Školní rok: 20xx/20xx"]
[]
["p. č.","Autor","Název díla"]
["Světová a česká literatura do konce 18. století (minimálně 2 díla)"]
[1,{"$f":"IFERROR(VLOOKUP(C9,SeznamCetby!A$3:E$83,2,FALSE),\"\")","v":""},{"$f":"IFERROR(INDEX(Table3[Dílo],SMALL(IF(Table3[Století]<=18,ROW(Table3[Dílo])-ROW(SerazenySeznam!C$2)+1),ROWS(SerazenySeznam!C$2:'SerazenySeznam'!C2))),\"\")","v":""}]
[{"$f":"IF(NOT(B10=\"\"),A9+1,\"\")","v":""},{"$f":"IFERROR(VLOOKUP(C10,SeznamCetby!A$3:E$83,2,FALSE),\"\")","v":""},{"$f":"IFERROR(INDEX(Table3[Dílo],SMALL(IF(Table3[Století]<=18,ROW(Table3[Dílo])-ROW(SerazenySeznam!C$2)+1),ROWS(SerazenySeznam!C$2:'SerazenySeznam'!C3))),\"\")","v":""}]
{"$rows_left_out":44}
{"sheet":"SeznamCetby","index":4,"n_rows":83,"n_cols":5,"rows_kept":83,"cut":false,"hidden":false,"merged":[[0,0,0,4]]}
["Platnost seznamu: od začátku školního roku 2019/2020"]
["Název díla","Autor","Století","Druh","Původ"]
["-","-","-","-","-"]
["Dekameron","Boccaccio Giovanni",14,"próza","světová"]
["Robinson Crusoe","Defoe Daniel",18,"próza","světová"]
["Labyrint světa a ráj srdce","Komenský Jan Amos",17,"próza","česká"]
["Lakomec","Moliére",17,"drama","světová"]
["Romeo a Julie","Shakespeare William",16,"drama","světová"]
["Zkrocení zlé ženy","Shakespeare William",16,"drama","světová"]
["Svatý Xaverius","Arbes Jakub",19,"próza","česká"]
{"$rows_left_out":74}
{"sheet":"Poznamky","index":5,"n_rows":16,"n_cols":2,"rows_kept":16,"cut":false,"hidden":false,"merged":[]}
["Verze:","3.3"]
["Autor:","Jakub Vašíček (github.com/jakubvasi)"]
[]
["Použití: "]
["Tento dokument slouží pro automatickou tvorbu maturitního seznamu."]
["Pro jeho správnou funkci je třeba při prvním spuštění povolit makra."]
["Na prvním listu stačí v libovolném pořadí vyplnit sloupec \"Dílo\". Zbytek se doplní automaticky."]
["Druhý list slouží pro kontrolu, zda seznam splňuje všechny podmínky."]
["Pokud je vše v pořádku, stačí přepnout na list \"Generator\", vyplnit své iniciály, aktuální datum a list vytisknout."]
[]
{"$rows_left_out":6}